Target
Cytochrome P450 3A4
Ligand
BDBM50380604
Substrate
Meas. Tech.
ChEMBL_813159 (CHEMBL2020825)
IC50
>50000±n/a nM
Citation
 Shultz, MDKirby, CAStams, TChin, DNBlank, JCharlat, OCheng, HCheung, ACong, FFeng, YFortin, PDHood, TTyagi, VXu, MZhang, BShao, W [1,2,4]triazol-3-ylsulfanylmethyl)-3-phenyl-[1,2,4]oxadiazoles: antagonists of the Wnt pathway that inhibit tankyrases 1 and 2 via novel adenosine pocket binding. J Med Chem 55:1127-36 (2012)  
Target
Name:
Cytochrome P450 3A4
Synonyms:
Albendazole monooxygenase CP3A4_HUMAN CYP3A4 CYPIIIA4 Cytochrome P450 3A4 (CYP3A4) Nifedipine oxidase Taurochenodeoxycholate 6-alpha-hydroxylase
Type:
Enzyme
Mol. Mass.:
57349.57
Organism:
Homo sapiens (Human)
Description:
Residue:
503
  
Inhibitor
Name:
BDBM50380604
Synonyms:
CHEMBL2016639
Type:
Small organic molecule
Emp. Form.:
C23H16FN5OS
Mol. Mass.:
429.469
SMILES:
Fc1ccc(cc1)-c1nnc(SCc2nc(no2)-c2ccccc2)n1-c1ccccc1
: