Target
Prothrombin
Ligand
BDBM50380626
Substrate
Meas. Tech.
ChEMBL_813174 (CHEMBL2020840)
Ki
6175±n/a nM
Citation
 Saupe, SMSteinmetzer, T A new strategy for the development of highly potent and selective plasmin inhibitors. J Med Chem 55:1171-80 (2012)  
Target
Name:
Prothrombin
Synonyms:
Activation peptide fragment 1 Coagulation factor II Prothrombin precursor Thrombin heavy chain | Thrombin light chain
Type:
Protein
Mol. Mass.:
70029.57
Organism:
Homo sapiens (Human)
Description:
P00734
Residue:
622
  
Inhibitor
Name:
BDBM50380626
Synonyms:
CHEMBL2016874
Type:
Small organic molecule
Emp. Form.:
C32H34N12O4S
Mol. Mass.:
682.755
SMILES:
NC(=N)c1ccc(CNC(=O)[C@@H]2Cc3cn(Cc4cccc(Cn5cc(C[C@@H](NS(=O)(=O)Cc6ccccc6)C(=O)N2)nn5)n4)nn3)cc1
: