Target
Coagulation factor X
Ligand
BDBM50380616
Substrate
Meas. Tech.
ChEMBL_813175 (CHEMBL2020841)
Ki
21±n/a nM
Citation
 Saupe, SMSteinmetzer, T A new strategy for the development of highly potent and selective plasmin inhibitors. J Med Chem 55:1171-80 (2012)  
Target
Name:
Coagulation factor X
Synonyms:
Activated coagulation factor X (FXa) Coagulation factor X precursor F10 Factor X heavy chain Factor Xa Stuart-Prower factor
Type:
Enzyme
Mol. Mass.:
54726.60
Organism:
Homo sapiens (Human)
Description:
Residue:
488
  
Inhibitor
Name:
BDBM50380616
Synonyms:
CHEMBL2016869
Type:
Small organic molecule
Emp. Form.:
C43H51N9O6S
Mol. Mass.:
821.987
SMILES:
NC(=N)c1ccc(CNC(=O)[C@@H]2Cc3cccc(CNC(=O)CN4CCN(CC4)CC(=O)NCc4cccc(C[C@@H](NS(=O)(=O)Cc5ccccc5)C(=O)N2)c4)c3)cc1
: