Target
Vitamin K-dependent protein C
Ligand
BDBM50380616
Substrate
Meas. Tech.
ChEMBL_813176 (CHEMBL2020842)
Ki
48±n/a nM
Citation
 Saupe, SMSteinmetzer, T A new strategy for the development of highly potent and selective plasmin inhibitors. J Med Chem 55:1171-80 (2012)  
Target
Name:
Vitamin K-dependent protein C
Synonyms:
Activated protein C cofactor Apolipoprotein H Blood coagulation factor XIV Coagulation factor V heavy chain Endothelial protein C receptor PROC_HUMAN Vitamin K-dependent protein C precursor
Type:
Enzyme
Mol. Mass.:
52067.73
Organism:
Homo sapiens (Human)
Description:
Residue:
461
  
Inhibitor
Name:
BDBM50380616
Synonyms:
CHEMBL2016869
Type:
Small organic molecule
Emp. Form.:
C43H51N9O6S
Mol. Mass.:
821.987
SMILES:
NC(=N)c1ccc(CNC(=O)[C@@H]2Cc3cccc(CNC(=O)CN4CCN(CC4)CC(=O)NCc4cccc(C[C@@H](NS(=O)(=O)Cc5ccccc5)C(=O)N2)c4)c3)cc1
: