Target
Vitamin K-dependent protein C
Ligand
BDBM50380627
Substrate
Meas. Tech.
ChEMBL_813176 (CHEMBL2020842)
Ki
>6000±n/a nM
Citation
 Saupe, SMSteinmetzer, T A new strategy for the development of highly potent and selective plasmin inhibitors. J Med Chem 55:1171-80 (2012)  
Target
Name:
Vitamin K-dependent protein C
Synonyms:
Activated protein C cofactor Apolipoprotein H Blood coagulation factor XIV Coagulation factor V heavy chain Endothelial protein C receptor PROC_HUMAN Vitamin K-dependent protein C precursor
Type:
Enzyme
Mol. Mass.:
52067.73
Organism:
Homo sapiens (Human)
Description:
Residue:
461
  
Inhibitor
Name:
BDBM50380627
Synonyms:
CHEMBL2016875
Type:
Small organic molecule
Emp. Form.:
C32H36N12O5S
Mol. Mass.:
700.771
SMILES:
NC(=N)c1ccc(CNC(=O)[C@@H]2Cc3cn(CC4=CCC=C(Cn5cc(C[C@@H](NS(=O)(=O)Cc6ccccc6)C(=O)N2)nn5)N4O)nn3)cc1
: