Target
Transient receptor potential M8 protein
Ligand
BDBM50380695
Substrate
Meas. Tech.
ChEMBL_813323 (CHEMBL2019444)
IC50
145±n/a nM
Citation
 Matthews, JMQin, NColburn, RWDax, SLHawkins, MMcNally, JJReany, LYoungman, MABaker, JHutchinson, TLiu, YLubin, MLNeeper, MBrandt, MRStone, DJFlores, CM The design and synthesis of novel, phosphonate-containing transient receptor potential melastatin 8 (TRPM8) antagonists. Bioorg Med Chem Lett 22:2922-6 (2012)  
Target
Name:
Transient receptor potential M8 protein
Synonyms:
Cold-menthol receptor (TRPM8) Transient receptor potential M8 protein Transient receptor potential melastatin subfamily, type 8 (TRPM8)
Type:
Enzyme
Mol. Mass.:
127589.43
Organism:
Canis lupus familiaris (Dog)
Description:
Q1A7N1
Residue:
1104
  
Inhibitor
Name:
BDBM50380695
Synonyms:
CHEMBL2017511
Type:
Small organic molecule
Emp. Form.:
C21H24BrO3PS
Mol. Mass.:
467.356
SMILES:
CCOP(=O)(OCC)C(Cc1cccc(Br)c1)c1sc2ccccc2c1C
: