Target
Cannabinoid receptor 2
Ligand
BDBM50380889
Substrate
Meas. Tech.
ChEMBL_812808 (CHEMBL2020075)
Ki
16±n/a nM
Citation
 Odan, MIshizuka, NHiramatsu, YInagaki, MHashizume, HFujii, YMitsumori, SMorioka, YSoga, MDeguchi, MYasui, KArimura, A Discovery of S-777469: an orally available CB2 agonist as an antipruritic agent. Bioorg Med Chem Lett 22:2803-6 (2012)  
Target
Name:
Cannabinoid receptor 2
Synonyms:
CANNABINOID CB2 CB2 CB2B CNR2_HUMAN Cannabinoid CB2 receptor Cannabinoid receptor 2 (CB2R) | hCB2
Type:
G Protein-Coupled Receptor (GPCR)
Mol. Mass.:
39690.94
Organism:
Homo sapiens (Human)
Description:
P34972
Residue:
360
  
Inhibitor
Name:
BDBM50380889
Synonyms:
CHEMBL2019086
Type:
Small organic molecule
Emp. Form.:
C26H31FN2O4
Mol. Mass.:
454.5337
SMILES:
OC(=O)C1(CCCCC1)NC(=O)c1cc2CCCCCCc2n(Cc2ccc(F)cc2)c1=O
: