Target
RAC-alpha serine/threonine-protein kinase
Ligand
BDBM50380932
Substrate
Meas. Tech.
ChEMBL_814081 (CHEMBL2020675)
IC50
1271±n/a nM
Citation
 Rice, KDKim, MHBussenius, JAnand, NKBlazey, CMBowles, OJCanne-Bannen, LChan, DSChen, BCo, EWCostanzo, SDeFina, SCDubenko, LEngst, SFranzini, MHuang, PJammalamadaka, VKhoury, RGKlein, RRLaird, ADLe, DTMac, MBMatthews, DJMarkby, DMiller, NNuss, JMParks, JJTsang, THTsuhako, ALWang, YXu, W Pyrazolopyrimidines as dual Akt/p70S6K inhibitors. Bioorg Med Chem Lett 22:2693-7 (2012)  
Target
Name:
RAC-alpha serine/threonine-protein kinase
Synonyms:
AKT phosphorylation (p-AKT) AKT1/PPP1CA C-AKT PKB alpha Protein kinase B Protein kinase B (Akt 1) Protein kinase B alpha Proto-oncogene Akt (Akt1) Proto-oncogene c-Akt (AKT1) RAC-PK-alpha RAC-alpha serine/threonine-protein kinase (AKT1) | RAC-alpha serine/threonine-protein kinase (pAKT)
Type:
Enzyme
Mol. Mass.:
55681.25
Organism:
Homo sapiens (Human)
Description:
P31749
Residue:
480
  
Inhibitor
Name:
BDBM50380932
Synonyms:
CHEMBL2016771
Type:
Small organic molecule
Emp. Form.:
C22H28BrClN8
Mol. Mass.:
519.868
SMILES:
Cc1c(NCCN2CCCC2)cc(Cl)cc1N1CCN(CC1)c1ncnc2n[nH]c(Br)c12
: