Target
Serine/threonine-protein kinase pim-1
Ligand
BDBM50381043
Substrate
Meas. Tech.
ChEMBL_814129 (CHEMBL2020770)
IC50
7±n/a nM
Citation
 Pierre, FRegan, CFChevrel, MCSiddiqui-Jain, AMacalino, DStreiner, NDrygin, DHaddach, MO'Brien, SERice, WGRyckman, DM Novel potent dual inhibitors of CK2 and Pim kinases with antiproliferative activity against cancer cells. Bioorg Med Chem Lett 22:3327-31 (2012)  
Target
Name:
Serine/threonine-protein kinase pim-1
Synonyms:
PIM-1 Kinase PIM1_HUMAN Serine/threonine-protein kinase (PIM1) Serine/threonine-protein kinase PIM1 | Serine/threonine-protein kinase pim-1 (PIM1)
Type:
Protein
Mol. Mass.:
35681.82
Organism:
Homo sapiens (Human)
Description:
P11309
Residue:
313
  
Inhibitor
Name:
BDBM50381043
Synonyms:
CHEMBL2017350
Type:
Small organic molecule
Emp. Form.:
C20H15N5OS
Mol. Mass.:
373.431
SMILES:
COc1ccccc1Nc1nc2c(cccc2c2sccc12)-c1nnc[nH]1
: