Target
Serine/threonine-protein kinase pim-2
Ligand
BDBM50381074
Substrate
Meas. Tech.
ChEMBL_814131 (CHEMBL2020772)
IC50
6±n/a nM
Citation
 Pierre, FRegan, CFChevrel, MCSiddiqui-Jain, AMacalino, DStreiner, NDrygin, DHaddach, MO'Brien, SERice, WGRyckman, DM Novel potent dual inhibitors of CK2 and Pim kinases with antiproliferative activity against cancer cells. Bioorg Med Chem Lett 22:3327-31 (2012)  
Target
Name:
Serine/threonine-protein kinase pim-2
Synonyms:
PIM2 Pim-2h Serine/threonine-protein kinase PIM | Serine/threonine-protein kinase pim-2 (PIM2)
Type:
Serine/threonine-protein kinase
Mol. Mass.:
34185.93
Organism:
Homo sapiens (Human)
Description:
Q9P1W9
Residue:
311
  
Inhibitor
Name:
BDBM50381074
Synonyms:
CHEMBL2017361
Type:
Small organic molecule
Emp. Form.:
C20H14FN5S
Mol. Mass.:
375.422
SMILES:
Cc1cc2c(Nc3ccccc3F)nc3c(cccc3c2s1)-c1nnc[nH]1
: