Target
C-C chemokine receptor type 2
Ligand
BDBM50381222
Substrate
Meas. Tech.
ChEMBL_814289 (CHEMBL2019386)
IC50
440±n/a nM
Citation
 Carter, PHBrown, GDKing, SRVoss, METebben, AJCherney, RJMandlekar, SLo, YCYang, GMiller, PBScherle, PAZhao, QDecicco, CP Discovery of an orally-bioavailable CC Chemokine Receptor 2 antagonist derived from an acyclic diaminoalcohol backbone. Bioorg Med Chem Lett 22:3311-6 (2012)  
Target
Name:
C-C chemokine receptor type 2
Synonyms:
C-C chemokine receptor type 2 (CCR2) CCR2_HUMAN Chemoattractant Cytokine Receptor 2 (CCR2) Monocyte chemotactic protein-1 (MCP-1)
Type:
Enzyme
Mol. Mass.:
41932.32
Organism:
Homo sapiens (Human)
Description:
P41597
Residue:
374
  
Inhibitor
Name:
BDBM50381222
Synonyms:
CHEMBL2018536
Type:
Small organic molecule
Emp. Form.:
C30H42F3N5O4
Mol. Mass.:
593.6808
SMILES:
CCC[C@H](O)[C@H](CN(C)Cc1ccc(C)cc1C)NC(=O)CNC(=O)c1cc(ccc1NC(=O)NC(C)C)C(F)(F)F
: