Target
B1 bradykinin receptor
Ligand
BDBM50381269
Substrate
Meas. Tech.
ChEMBL_814371 (CHEMBL2019580)
IC50
52±n/a nM
Citation
 Eles, JBeke, GVágó, IBozó, EHuszár, JTarcsay, AKolok, SSchmidt, EVastag, MHornok, KFarkas, SDomány, GKeseru, GM Quinolinyl- and phenantridinyl-acetamides as bradykinin B1 receptor antagonists. Bioorg Med Chem Lett 22:3095-9 (2012)  
Target
Name:
B1 bradykinin receptor
Synonyms:
B1 BRADYKININ B1bkr BKRB1_RAT Bkr KB1 | Kinin B1 receptor
Type:
Enzyme Catalytic Domain
Mol. Mass.:
38389.97
Organism:
RAT
Description:
B1 BRADYKININ BDKRB1 RAT::P97583
Residue:
337
  
Inhibitor
Name:
BDBM50381269
Synonyms:
CHEMBL2018869
Type:
Small organic molecule
Emp. Form.:
C33H32N4O3S
Mol. Mass.:
564.697
SMILES:
Cc1ccc(cc1)S(=O)(=O)N1C(CC(=O)NCCc2ccc(cc2)C2=NCCN2)c2ccccc2-c2ccccc12
: