Target
B1 bradykinin receptor
Ligand
BDBM50381270
Substrate
Meas. Tech.
ChEMBL_814368 (CHEMBL2019577)
Ki
2.9±n/a nM
Citation
 Eles, JBeke, GVágó, IBozó, EHuszár, JTarcsay, AKolok, SSchmidt, EVastag, MHornok, KFarkas, SDomány, GKeseru, GM Quinolinyl- and phenantridinyl-acetamides as bradykinin B1 receptor antagonists. Bioorg Med Chem Lett 22:3095-9 (2012)  
Target
Name:
B1 bradykinin receptor
Synonyms:
B1 BRADYKININ B1R BK-1 receptor BRADYB1 | Bradykinin B1 receptor
Type:
Enzyme
Mol. Mass.:
40508.87
Organism:
Homo sapiens (Human)
Description:
P46663
Residue:
353
  
Inhibitor
Name:
BDBM50381270
Synonyms:
CHEMBL2018868
Type:
Small organic molecule
Emp. Form.:
C35H36N4O3S
Mol. Mass.:
592.75
SMILES:
Cc1cc(C)c(cc1C)S(=O)(=O)N1C(CC(=O)NCCc2ccc(cc2)C2=NCCN2)c2ccccc2-c2ccccc12
: