Target
B1 bradykinin receptor
Ligand
BDBM50381283
Substrate
Meas. Tech.
ChEMBL_814368 (CHEMBL2019577)
Ki
1400±n/a nM
Citation
 Eles, JBeke, GVágó, IBozó, EHuszár, JTarcsay, AKolok, SSchmidt, EVastag, MHornok, KFarkas, SDomány, GKeseru, GM Quinolinyl- and phenantridinyl-acetamides as bradykinin B1 receptor antagonists. Bioorg Med Chem Lett 22:3095-9 (2012)  
Target
Name:
B1 bradykinin receptor
Synonyms:
B1 BRADYKININ B1R BK-1 receptor BRADYB1 | Bradykinin B1 receptor
Type:
Enzyme
Mol. Mass.:
40508.87
Organism:
Homo sapiens (Human)
Description:
P46663
Residue:
353
  
Inhibitor
Name:
BDBM50381283
Synonyms:
CHEMBL2018857
Type:
Small organic molecule
Emp. Form.:
C22H17Cl2N3O4S
Mol. Mass.:
490.359
SMILES:
Clc1ccc(cc1Cl)S(=O)(=O)N1C(CC(=O)Nc2ccccc2)C(=O)Nc2ccccc12
: