Target
Carbonic anhydrase 2
Ligand
BDBM26664
Substrate
Meas. Tech.
ChEMBL_814442 (CHEMBL2019838)
Ki
2240±n/a nM
Citation
 Balboni, GCongiu, COnnis, VMaresca, AScozzafava, AWinum, JYMaietti, ASupuran, CT Flavones and structurally related 4-chromenones inhibit carbonic anhydrases by a different mechanism of action compared to coumarins. Bioorg Med Chem Lett 22:3063-6 (2012)  
Target
Name:
Carbonic anhydrase 2
Synonyms:
CA-II CAC Carbonate dehydratase II Carbonic anhydrase 2 (CA-II) Carbonic anhydrase C Carbonic anhydrase II (CA-II) Carbonic anhydrase II (hCA II) | Carbonic anhydrase isoenzyme II (hCA II)
Type:
Enzyme
Mol. Mass.:
29250.71
Organism:
Homo sapiens (Human)
Description:
P00918
Residue:
260
  
Inhibitor
Name:
BDBM26664
Synonyms:
7-Hydroxy-flavone, 5a 7-hydroxy-2-phenyl-4H-chromen-4-one CHEMBL276915
Type:
Flavonoid
Emp. Form.:
C15H10O3
Mol. Mass.:
238.2381
SMILES:
Oc1ccc2c(c1)oc(cc2=O)-c1ccccc1
: