Target
Carbonic anhydrase 14
Ligand
BDBM23926
Substrate
Meas. Tech.
ChEMBL_814454 (CHEMBL2019850)
Ki
1950±n/a nM
Citation
 Balboni, GCongiu, COnnis, VMaresca, AScozzafava, AWinum, JYMaietti, ASupuran, CT Flavones and structurally related 4-chromenones inhibit carbonic anhydrases by a different mechanism of action compared to coumarins. Bioorg Med Chem Lett 22:3063-6 (2012)  
Target
Name:
Carbonic anhydrase 14
Synonyms:
CA-XIV CAH14_HUMAN Carbonic Anhydrase XIV Carbonic anhydrase 14 Carbonic anhydrase XIV (CA XIV)
Type:
Enzyme
Mol. Mass.:
37665.67
Organism:
Homo sapiens (Human)
Description:
Human (cloned) isozyme.
Residue:
337
  
Inhibitor
Name:
BDBM23926
Synonyms:
(E)-resveratrol CHEMBL165 Stilbene, 2f cid_445154 trans-resveratrol
Type:
Small organic molecule
Emp. Form.:
C14H12O3
Mol. Mass.:
228.2433
SMILES:
Oc1ccc(\C=C\c2cc(O)cc(O)c2)cc1
: