Target
Carboxylic ester hydrolase
Ligand
BDBM50359390
Substrate
Meas. Tech.
ChEMBL_815076 (CHEMBL2024801)
IC50
>100000±n/a nM
Citation
 Samadi, Ade los Ríos, CBolea, IChioua, MIriepa, IMoraleda, IBartolini, MAndrisano, VGálvez, EValderas, CUnzeta, MMarco-Contelles, J Multipotent MAO and cholinesterase inhibitors for the treatment of Alzheimer's disease: synthesis, pharmacological analysis and molecular modeling of heterocyclic substituted alkyl and cycloalkyl propargyl amine. Eur J Med Chem 52:251-62 (2012)  
Target
Name:
Carboxylic ester hydrolase
Synonyms:
BuChE Butyrylcholine esterase Butyrylcholinesterase (BChE) Butyrylcholinesterase (EqBuChE) butyrylcholinesterase precursor
Type:
Protein
Mol. Mass.:
68842.83
Organism:
Equus caballus (Horse)
Description:
Q9N1N9
Residue:
602
  
Inhibitor
Name:
BDBM50359390
Synonyms:
CHEMBL1929418 | CHEMBL2022924
Type:
Small organic molecule
Emp. Form.:
C21H22N2O
Mol. Mass.:
318.4122
SMILES:
CN(CC#C)Cc1cc2cc(OCc3ccccc3)ccc2n1C
: