Target
Amine oxidase [flavin-containing] B
Ligand
BDBM50381952
Substrate
Meas. Tech.
ChEMBL_814867 (CHEMBL2026609)
IC50
356900±n/a nM
Citation
 Samadi, Ade los Ríos, CBolea, IChioua, MIriepa, IMoraleda, IBartolini, MAndrisano, VGálvez, EValderas, CUnzeta, MMarco-Contelles, J Multipotent MAO and cholinesterase inhibitors for the treatment of Alzheimer's disease: synthesis, pharmacological analysis and molecular modeling of heterocyclic substituted alkyl and cycloalkyl propargyl amine. Eur J Med Chem 52:251-62 (2012)  
Target
Name:
Amine oxidase [flavin-containing] B
Synonyms:
AOFB_RAT Amine oxidase [flavin-containing] B Monoamine Oxidase Type B (MAO-B) Monoamine oxidase B (MAO-B) Monoamine oxidase type B (MAOB) | Monoamine oxidase-B (MAO-B)
Type:
Enzyme
Mol. Mass.:
58469.65
Organism:
Rattus norvegicus (rat)
Description:
P19643
Residue:
520
  
Inhibitor
Name:
BDBM50381952
Synonyms:
CHEMBL2022933
Type:
Small organic molecule
Emp. Form.:
C19H20N6
Mol. Mass.:
332.4023
SMILES:
Nc1c2CN(CC#C)CCc2nc2nc(N3CCCC3)c(cc12)C#N
: