Target
Acetylcholine receptor subunit alpha
Ligand
BDBM50381980
Substrate
Meas. Tech.
ChEMBL_815098 (CHEMBL2024823)
IC50
3981.07±n/a nM
Citation
 Skidmore, JAtcha, ZBoucherat, ECastelletti, LChen, DWCoppo, FTCutler, LDunsdon, RMHeath, BMHutchings, RHurst, DNJaved, SMartin, SMaskell, ESNorton, DPemberton, DJRedshaw, SRutter, RSehmi, SSScoccitti, TTemple, HETheobald, PWard, RWWilson, DM Identification of a series of 1,3,4-oxadiazol-2-amines as potent alpha-7 agonists with efficacy in the novel object recognition model of cognition. Bioorg Med Chem Lett 22:3560-3 (2012)  
Target
Name:
Acetylcholine receptor subunit alpha
Synonyms:
ACHA_HUMAN Acetylcholine receptor protein alpha chain CHNRA Cholinergic, Nicotinic Alpha1Beta1DeltaGamma Nicotinic acetylcholine receptor alpha-1/beta-1 Nicotinic acetylcholine receptor alpha2/beta4 n-AChR
Type:
Ion channel
Mol. Mass.:
54542.01
Organism:
Homo sapiens (Human)
Description:
Residue:
482
  
Inhibitor
Name:
BDBM50381980
Synonyms:
CHEMBL2022495
Type:
Small organic molecule
Emp. Form.:
C24H28FN5O3
Mol. Mass.:
453.5092
SMILES:
COc1cc(NC(=O)c2ccccc2F)ccc1-c1nnc(NCCCN2CCCCC2)o1
: