Target
Neuronal acetylcholine receptor subunit alpha-7
Ligand
BDBM50381982
Substrate
Meas. Tech.
ChEMBL_815079 (CHEMBL2024804)
EC50
100±n/a nM
Citation
 Skidmore, JAtcha, ZBoucherat, ECastelletti, LChen, DWCoppo, FTCutler, LDunsdon, RMHeath, BMHutchings, RHurst, DNJaved, SMartin, SMaskell, ESNorton, DPemberton, DJRedshaw, SRutter, RSehmi, SSScoccitti, TTemple, HETheobald, PWard, RWWilson, DM Identification of a series of 1,3,4-oxadiazol-2-amines as potent alpha-7 agonists with efficacy in the novel object recognition model of cognition. Bioorg Med Chem Lett 22:3560-3 (2012)  
Target
Name:
Neuronal acetylcholine receptor subunit alpha-7
Synonyms:
ACHA7_HUMAN Cholinergic, Nicotinic Alpha7 Neuronal acetylcholine receptor protein alpha-7 subunit Nicotinic acetylcholine receptor alpha-7 (alpha7 nAChR)
Type:
Mol. Mass.:
56448.33
Organism:
Homo sapiens (Human)
Description:
CHRNA7 (NACHRA7)
Residue:
502
  
Inhibitor
Name:
BDBM50381982
Synonyms:
CHEMBL2023927
Type:
Small organic molecule
Emp. Form.:
C25H30FN5O3
Mol. Mass.:
467.5358
SMILES:
CCOc1cc(NC(=O)c2ccccc2F)ccc1-c1nnc(NCCCN2CCCCC2)o1
: