Target
Aurora kinase B
Ligand
BDBM50382023
Substrate
Meas. Tech.
ChEMBL_815110 (CHEMBL2024835)
IC50
>3000±n/a nM
Citation
 Voss, MERainka, MPFleming, MPeterson, LHBelanger, DBSiddiqui, MAHruza, AVoigt, JGray, KBasso, AD Synthesis and SAR studies of imidazo-[1,2-a]-pyrazine Aurora kinase inhibitors with improved off-target kinase selectivity. Bioorg Med Chem Lett 22:3544-9 (2012)  
Target
Name:
Aurora kinase B
Synonyms:
AIK2 AIM1 ARK2 AURKB_HUMAN Aurora B-INCENP Aurora kinase B (AURKB) STK-1 STK12 Serine/threonine-protein kinase aurora B
Type:
Protein
Mol. Mass.:
39327.72
Organism:
Homo sapiens (Human)
Description:
Q96GD4
Residue:
344
  
Inhibitor
Name:
BDBM50382023
Synonyms:
CHEMBL2022119
Type:
Small organic molecule
Emp. Form.:
C25H31N9O2S
Mol. Mass.:
521.638
SMILES:
Cc1cn2c(cnc2c(Nc2cc(CN3CCCCC3)ns2)n1)-c1cnn(CC(=O)N2CCOCC2)c1
: