Target
Aurora kinase A
Ligand
BDBM50382010
Substrate
Meas. Tech.
ChEMBL_815109 (CHEMBL2024834)
IC50
22±n/a nM
Citation
 Voss, MERainka, MPFleming, MPeterson, LHBelanger, DBSiddiqui, MAHruza, AVoigt, JGray, KBasso, AD Synthesis and SAR studies of imidazo-[1,2-a]-pyrazine Aurora kinase inhibitors with improved off-target kinase selectivity. Bioorg Med Chem Lett 22:3544-9 (2012)  
Target
Name:
Aurora kinase A
Synonyms:
AIK ARK1 AURKA AYK1 Aurora kinase A (AURA) Aurora kinase A (Aurora A) Aurora-related kinase 1 BTAK Breast-tumor-amplified kinase STK15 Serine/threonine kinase 15 Serine/threonine-protein kinase aurora A hARK1
Type:
Serine/threonine-protein kinase
Mol. Mass.:
45830.98
Organism:
Homo sapiens (Human)
Description:
O14965
Residue:
403
  
Inhibitor
Name:
BDBM50382010
Synonyms:
CHEMBL2023297
Type:
Small organic molecule
Emp. Form.:
C28H29F2N9OS
Mol. Mass.:
577.651
SMILES:
Cc1cn2c(cnc2c(Nc2cc(CN3CCCCC3)ns2)n1)-c1cnn(CC(=O)NCc2cc(F)cc(F)c2)c1
: