Target
Neuronal acetylcholine receptor subunit alpha-7
Ligand
BDBM50382049
Substrate
Meas. Tech.
ChEMBL_815354 (CHEMBL2026858)
EC50
79.43±n/a nM
Citation
 Skidmore, JAtcha, ZBoucherat, ECastelletti, LChen, DWCoppo, FTCutler, LDunsdon, RMHeath, BMHutchings, RHurst, DNJaved, SMartin, SMaskell, ESNorton, DPemberton, DJRedshaw, SRutter, RSehmi, SSScoccitti, TTemple, HETheobald, PWard, RWWilson, DM The discovery of 2-fluoro-N-(3-fluoro-4-(5-((4-morpholinobutyl)amino)-1,3,4-oxadiazol-2-yl)phenyl)benzamide, a full agonist of the alpha-7 nicotinic acetylcholine receptor showing efficacy in the novel object recognition model of cognition enhancement. Bioorg Med Chem Lett 22:3531-4 (2012)  
Target
Name:
Neuronal acetylcholine receptor subunit alpha-7
Synonyms:
ACHA7_HUMAN Cholinergic, Nicotinic Alpha7 Neuronal acetylcholine receptor protein alpha-7 subunit Nicotinic acetylcholine receptor alpha-7 (alpha7 nAChR)
Type:
Mol. Mass.:
56448.33
Organism:
Homo sapiens (Human)
Description:
CHRNA7 (NACHRA7)
Residue:
502
  
Inhibitor
Name:
BDBM50382049
Synonyms:
CHEMBL2022741
Type:
Small organic molecule
Emp. Form.:
C24H27F2N5O2
Mol. Mass.:
455.5003
SMILES:
FC1CCN(CCCCNc2nnc(o2)-c2ccc(NC(=O)c3ccccc3F)cc2)CC1
: