Target
Acid ceramidase
Ligand
BDBM50382315
Substrate
Meas. Tech.
ChEMBL_816889 (CHEMBL2026160)
IC50
51000±n/a nM
Citation
 Camacho, LSimbari, FGarrido, MAbad, JLCasas, JDelgado, AFabriàs, G 3-Deoxy-3,4-dehydro analogs of XM462. Preparation and activity on sphingolipid metabolism and cell fate. Bioorg Med Chem 20:3173-9 (2012)  
Target
Name:
Acid ceramidase
Synonyms:
ASAH ASAH1_HUMAN Acid ceramidase (AC)
Type:
Enzyme
Mol. Mass.:
44662.65
Organism:
Homo sapiens (Human)
Description:
Q13510
Residue:
395
  
Inhibitor
Name:
BDBM50382315
Synonyms:
CHEMBL2024682
Type:
Small organic molecule
Emp. Form.:
C22H43NO2S
Mol. Mass.:
385.647
SMILES:
CCCCCCCCCCCCCS\C=C\[C@H](CO)NC(=O)C(C)(C)C
: