Target
Acid ceramidase
Ligand
BDBM50382314
Substrate
Meas. Tech.
ChEMBL_816888 (CHEMBL2026159)
IC50
77000±n/a nM
Citation
 Camacho, LSimbari, FGarrido, MAbad, JLCasas, JDelgado, AFabriàs, G 3-Deoxy-3,4-dehydro analogs of XM462. Preparation and activity on sphingolipid metabolism and cell fate. Bioorg Med Chem 20:3173-9 (2012)  
Target
Name:
Acid ceramidase
Synonyms:
ASAH ASAH1_HUMAN Acid ceramidase (AC)
Type:
Enzyme
Mol. Mass.:
44662.65
Organism:
Homo sapiens (Human)
Description:
Q13510
Residue:
395
  
Inhibitor
Name:
BDBM50382314
Synonyms:
CHEMBL2024680
Type:
Small organic molecule
Emp. Form.:
C25H49NO2S
Mol. Mass.:
427.727
SMILES:
CCCCCCCCCCCCCS\C=C\[C@H](CO)NC(=O)CCCCCCC
: