Target
Acid ceramidase
Ligand
BDBM50382316
Substrate
Meas. Tech.
ChEMBL_816888 (CHEMBL2026159)
IC50
315000±n/a nM
Citation
 Camacho, LSimbari, FGarrido, MAbad, JLCasas, JDelgado, AFabriàs, G 3-Deoxy-3,4-dehydro analogs of XM462. Preparation and activity on sphingolipid metabolism and cell fate. Bioorg Med Chem 20:3173-9 (2012)  
Target
Name:
Acid ceramidase
Synonyms:
ASAH ASAH1_HUMAN Acid ceramidase (AC)
Type:
Enzyme
Mol. Mass.:
44662.65
Organism:
Homo sapiens (Human)
Description:
Q13510
Residue:
395
  
Inhibitor
Name:
BDBM50382316
Synonyms:
CHEMBL2024681
Type:
Small organic molecule
Emp. Form.:
C28H47NO2S
Mol. Mass.:
461.743
SMILES:
CCCCCCCCCCCCCS\C=C\[C@H](CO)NC(=O)c1ccc(cc1)C(C)(C)C
: