Target
1,4-dihydroxy-2-naphthoyl-CoA synthase
Ligand
BDBM50382351
Substrate
Meas. Tech.
ChEMBL_817596 (CHEMBL2027819)
IC50
135±n/a nM
Citation
 Li, XLiu, NZhang, HKnudson, SELi, HJLai, CTSimmerling, CSlayden, RATonge, PJ CoA Adducts of 4-Oxo-4-Phenylbut-2-enoates: Inhibitors of MenB from the M. tuberculosis Menaquinone Biosynthesis Pathway. ACS Med Chem Lett 2:818-823 (2011)  
Target
Name:
1,4-dihydroxy-2-naphthoyl-CoA synthase
Synonyms:
DHNA-CoA synthase menB
Type:
PROTEIN
Mol. Mass.:
34688.06
Organism:
Mycobacterium tuberculosis
Description:
ChEMBL_817596
Residue:
314
  
Inhibitor
Name:
BDBM50382351
Synonyms:
CHEMBL2024339
Type:
Small organic molecule
Emp. Form.:
C31H43BrN7O19P3S
Mol. Mass.:
1022.599
SMILES:
CC(C)(COP(O)(=O)OP(O)(=O)OC[C@H]1O[C@H]([C@H](O)[C@@H]1OP(O)(O)=O)n1cnc2c(N)ncnc12)[C@@H](O)C(=O)NCCC(=O)NCCSC(CC(=O)c1ccccc1Br)C(O)=O
: