Target
Tyrosine-protein kinase receptor UFO
Ligand
BDBM50382425
Substrate
Meas. Tech.
ChEMBL_815467 (CHEMBL2027235)
EC50
222±n/a nM
Citation
 Mollard, AWarner, SLCall, LTWade, MLBearss, JJVerma, ASharma, SVankayalapati, HBearss, DJ Design, Synthesis and Biological Evaluation of a Series of Novel Axl Kinase Inhibitors. ACS Med Chem Lett 2:907-912 (2011)  
Target
Name:
Tyrosine-protein kinase receptor UFO
Synonyms:
AXL TEL/AXL UFO | UFO_HUMAN
Type:
Enzyme
Mol. Mass.:
98316.97
Organism:
Homo sapiens (Human)
Description:
P30530
Residue:
894
  
Inhibitor
Name:
BDBM50382425
Synonyms:
CHEMBL2022968
Type:
Small organic molecule
Emp. Form.:
C24H30ClN7O2S
Mol. Mass.:
516.059
SMILES:
CN(C)S(=O)(=O)c1ccccc1Nc1nc(Nc2ccc(CN3CCN(C)CC3)cc2)ncc1Cl
: