Target
Tyrosine-protein kinase receptor UFO
Ligand
BDBM50382431
Substrate
Meas. Tech.
ChEMBL_815463 (CHEMBL2027231)
IC50
32±n/a nM
Citation
 Mollard, AWarner, SLCall, LTWade, MLBearss, JJVerma, ASharma, SVankayalapati, HBearss, DJ Design, Synthesis and Biological Evaluation of a Series of Novel Axl Kinase Inhibitors. ACS Med Chem Lett 2:907-912 (2011)  
Target
Name:
Tyrosine-protein kinase receptor UFO
Synonyms:
AXL TEL/AXL UFO | UFO_HUMAN
Type:
Enzyme
Mol. Mass.:
98316.97
Organism:
Homo sapiens (Human)
Description:
P30530
Residue:
894
  
Inhibitor
Name:
BDBM50382431
Synonyms:
CHEMBL2022974
Type:
Small organic molecule
Emp. Form.:
C26H30ClN7O
Mol. Mass.:
492.016
SMILES:
CN1CCN(Cc2ccc(Nc3ncc(Cl)c(Nc4ccccc4C(=O)NC4CC4)n3)cc2)CC1
: