Target
Signal transducer and activator of transcription 5B
Ligand
BDBM50353444
Substrate
Meas. Tech.
ChEMBL_815758 (CHEMBL2025842)
Ki
4100±n/a nM
Citation
 Page, BDKhoury, HLaister, RCFletcher, SVellozo, MManzoli, AYue, PTurkson, JMinden, MDGunning, PT Small molecule STAT5-SH2 domain inhibitors exhibit potent antileukemia activity. J Med Chem 55:1047-55 (2012)  
Target
Name:
Signal transducer and activator of transcription 5B
Synonyms:
STA5B_HUMAN Signal transducer and activator of transcription 5B | Transcription factor STAT5b (STAT5b)
Type:
Protein
Mol. Mass.:
89858.26
Organism:
Homo sapiens (Human)
Description:
Residue:
787
  
Inhibitor
Name:
BDBM50353444
Synonyms:
CHEMBL1829870 | US10196373, Compound 45C
Type:
Small organic molecule
Emp. Form.:
C35H36N2O6S
Mol. Mass.:
612.735
SMILES:
CN(CC(=O)N(Cc1ccc(cc1)C1CCCCC1)c1ccc(C(O)=O)c(O)c1)S(=O)(=O)c1ccc(cc1)-c1ccccc1
: