Target
Adenosine receptor A1
Ligand
BDBM50382493
Substrate
Meas. Tech.
ChEMBL_816162 (CHEMBL2024728)
Ki
398.11±n/a nM
Citation
 Congreve, MAndrews, SPDoré, ASHollenstein, KHurrell, ELangmead, CJMason, JSNg, IWTehan, BZhukov, AWeir, MMarshall, FH Discovery of 1,2,4-triazine derivatives as adenosine A(2A) antagonists using structure based drug design. J Med Chem 55:1898-903 (2012)  
Target
Name:
Adenosine receptor A1
Synonyms:
A1 adenosine receptor (hA1) AA1R_HUMAN ADORA1 Adenosine A1-receptor Adenosine receptor A1 (hA1) | Adenosine transporter (AdT)
Type:
G Protein-Coupled Receptor (GPCR)
Mol. Mass.:
36520.92
Organism:
Homo sapiens (Human)
Description:
P30542
Residue:
326
  
Inhibitor
Name:
BDBM50382493
Synonyms:
CHEMBL2024116
Type:
Small organic molecule
Emp. Form.:
C16H14FN5
Mol. Mass.:
295.3143
SMILES:
Cc1cc(cc(C)n1)-c1nnc(N)nc1-c1ccc(F)cc1
: