Target
Carbonic anhydrase 2
Ligand
BDBM50382726
Substrate
Meas. Tech.
ChEMBL_817438 (CHEMBL2027661)
Ki
3.6±n/a nM
Citation
 Carta, FAggarwal, MMaresca, AScozzafava, AMcKenna, RMasini, ESupuran, CT Dithiocarbamates strongly inhibit carbonic anhydrases and show antiglaucoma action in vivo. J Med Chem 55:1721-30 (2012)  
Target
Name:
Carbonic anhydrase 2
Synonyms:
CA-II CAC Carbonate dehydratase II Carbonic anhydrase 2 (CA-II) Carbonic anhydrase C Carbonic anhydrase II (CA-II) Carbonic anhydrase II (hCA II) | Carbonic anhydrase isoenzyme II (hCA II)
Type:
Enzyme
Mol. Mass.:
29250.71
Organism:
Homo sapiens (Human)
Description:
P00918
Residue:
260
  
Inhibitor
Name:
BDBM50382726
Synonyms:
CHEMBL2023163
Type:
Small organic molecule
Emp. Form.:
C5H9N2OS2
Mol. Mass.:
177.268
SMILES:
[S-]C(=S)NN1CCOCC1
: