Target
Carbonic anhydrase 2
Ligand
BDBM50382721
Substrate
Meas. Tech.
ChEMBL_817438 (CHEMBL2027661)
Ki
25±n/a nM
Citation
 Carta, FAggarwal, MMaresca, AScozzafava, AMcKenna, RMasini, ESupuran, CT Dithiocarbamates strongly inhibit carbonic anhydrases and show antiglaucoma action in vivo. J Med Chem 55:1721-30 (2012)  
Target
Name:
Carbonic anhydrase 2
Synonyms:
CA-II CAC Carbonate dehydratase II Carbonic anhydrase 2 (CA-II) Carbonic anhydrase C Carbonic anhydrase II (CA-II) Carbonic anhydrase II (hCA II) | Carbonic anhydrase isoenzyme II (hCA II)
Type:
Enzyme
Mol. Mass.:
29250.71
Organism:
Homo sapiens (Human)
Description:
P00918
Residue:
260
  
Inhibitor
Name:
BDBM50382721
Synonyms:
CHEMBL2023726
Type:
Small organic molecule
Emp. Form.:
C9H10NS2
Mol. Mass.:
196.313
SMILES:
CN(Cc1ccccc1)C([S-])=S
: