Target
Carbonic anhydrase 9
Ligand
BDBM50382711
Substrate
Meas. Tech.
ChEMBL_817439 (CHEMBL2027662)
Ki
4.3±n/a nM
Citation
 Carta, FAggarwal, MMaresca, AScozzafava, AMcKenna, RMasini, ESupuran, CT Dithiocarbamates strongly inhibit carbonic anhydrases and show antiglaucoma action in vivo. J Med Chem 55:1721-30 (2012)  
Target
Name:
Carbonic anhydrase 9
Synonyms:
CA-IX CAH9_HUMAN Carbonic anhydrase 9 (CA IX) Carbonic anhydrase 9 precursor Carbonic anhydrase IX (CAIX) Carbonic anhydrases; II & IX MN RCC-associated antigen G250
Type:
Enzyme
Mol. Mass.:
49669.03
Organism:
Homo sapiens (Human)
Description:
Catalytic domain of human cloned isozyme was used in the assay
Residue:
459
  
Inhibitor
Name:
BDBM50382711
Synonyms:
CHEMBL2023718 | CHEMBL2334361
Type:
Small organic molecule
Emp. Form.:
C7H10N3S2
Mol. Mass.:
200.305
SMILES:
[S-]C(=S)NCCCn1ccnc1
: