Target
Cannabinoid receptor 2
Ligand
BDBM50382744
Substrate
Meas. Tech.
ChEMBL_815227 (CHEMBL2025418)
Ki
4.6±n/a nM
Citation
 Odan, MIshizuka, NHiramatsu, YInagaki, MHashizume, HFujii, YMitsumori, SMorioka, YSoga, MDeguchi, MYasui, KArimura, A Discovery of S-444823, a potent CB1/CB2 dual agonist as an antipruritic agent. Bioorg Med Chem Lett 22:2898-901 (2012)  
Target
Name:
Cannabinoid receptor 2
Synonyms:
CANNABINOID CB2 CB2 CB2B CNR2_HUMAN Cannabinoid CB2 receptor Cannabinoid receptor 2 (CB2R) | hCB2
Type:
G Protein-Coupled Receptor (GPCR)
Mol. Mass.:
39690.94
Organism:
Homo sapiens (Human)
Description:
P34972
Residue:
360
  
Inhibitor
Name:
BDBM50382744
Synonyms:
CHEMBL2023582
Type:
Small organic molecule
Emp. Form.:
C24H31N3O4S
Mol. Mass.:
457.586
SMILES:
OC(=O)Cc1cnc(NC(=O)c2cc3CCCCCCc3n(CC3CCCCC3)c2=O)s1
: