Target
Calcitonin gene-related peptide type 1 receptor
Ligand
BDBM50382794
Substrate
Meas. Tech.
ChEMBL_815271 (CHEMBL2026486)
Ki
0.18±n/a nM
Citation
 Luo, GChen, LCiviello, RPin, SSXu, CKostich, WKelley, MConway, CMMacor, JEDubowchik, GM Calcitonin gene-related peptide (CGRP) receptor antagonists: pyridine as a replacement for a core amide group. Bioorg Med Chem Lett 22:2917-21 (2012)  
Target
Name:
Calcitonin gene-related peptide type 1 receptor
Synonyms:
Adrenomedullin receptor AM1; CALCRL/RAMP2 CALRL_HUMAN CGRP type 1 receptor mRNA Calcitonin gene-related peptide (CGRP) receptor Calcitonin receptor-like receptor Human CL receptor
Type:
Enzyme Catalytic Domain
Mol. Mass.:
52980.45
Organism:
Homo sapiens (Human)
Description:
Q16602
Residue:
461
  
Inhibitor
Name:
BDBM50382794
Synonyms:
CHEMBL2023191
Type:
Small organic molecule
Emp. Form.:
C30H31ClN8O4
Mol. Mass.:
603.071
SMILES:
CN(C)C(=O)c1cc(Cl)nc(c1)C(Cc1cc(C)c2[nH]ncc2c1)OC(=O)N1CCC(CC1)n1c2cccnc2[nH]c1=O
: