Target
Lysosomal Pro-X carboxypeptidase
Ligand
BDBM50382901
Substrate
Meas. Tech.
ChEMBL_815279 (CHEMBL2026494)
IC50
100±n/a nM
Citation
 Graham, THLiu, WVerras, ASebhat, IKXiong, YBleasby, KBhatt, URChen, QGarcia-Calvo, MGeissler, WMGorski, JNHe, HLassman, MELisnock, JLi, XShen, ZTong, XTung, ECWiltsie, JXiao, JXie, DXu, SHale, JJPinto, SShen, DM A new class of prolylcarboxypeptidase inhibitors, part 1: discovery and evaluation. Bioorg Med Chem Lett 22:2811-7 (2012)  
Target
Name:
Lysosomal Pro-X carboxypeptidase
Synonyms:
Angiotensinase C PCP PRCP Prolylcarboxypeptidase | Prolylcarboxypeptidase (PRCP)
Type:
Enzyme
Mol. Mass.:
55805.19
Organism:
Homo sapiens (Human)
Description:
P42785
Residue:
496
  
Inhibitor
Name:
BDBM50382901
Synonyms:
CHEMBL2022790
Type:
Small organic molecule
Emp. Form.:
C30H32ClF5N4O
Mol. Mass.:
595.046
SMILES:
CC(C)(C)N1C[C@H]([C@@H](C1)c1ccc(F)cc1F)C(=O)N1CCC(CC1)c1cc(nn1-c1ccc(Cl)cc1)C(F)(F)F
: