Target
Tyrosine-protein kinase ABL1
Ligand
BDBM50382959
Substrate
Meas. Tech.
ChEMBL_817978 (CHEMBL2033404)
Kd
3±n/a nM
Citation
 Rowbottom, MWFaraoni, RChao, QCampbell, BTLai, AGSetti, EEzawa, MSprankle, KGAbraham, STran, LStruss, BGibney, MArmstrong, RCGunawardane, RNNepomuceno, RRValenta, IHua, HGardner, MFCramer, MDGitnick, DInsko, DEApuy, JLJones-Bolin, SGhose, AKHerbertz, TAtor, MADorsey, BDRuggeri, BWilliams, MBhagwat, SJames, JHolladay, MW Identification of 1-(3-(6,7-dimethoxyquinazolin-4-yloxy)phenyl)-3-(5-(1,1,1-trifluoro-2-methylpropan-2-yl)isoxazol-3-yl)urea hydrochloride (CEP-32496), a highly potent and orally efficacious inhibitor of V-RAF murine sarcoma viral oncogene homologue B1 (BRAF) V600E. J Med Chem 55:1082-105 (2012)  
Target
Name:
Tyrosine-protein kinase ABL1
Synonyms:
ABL ABL1_HUMAN JTK7 Proto-oncogene tyrosine-protein kinase ABL1 Tyrosine-protein kinase ABL V-abl Abelson murine leukemia viral oncogene homolog 1 p150 | tyrosine-protein kinase ABL1 isoform a
Type:
Enzyme
Mol. Mass.:
122897.30
Organism:
Homo sapiens (Human)
Description:
P00519
Residue:
1130
  
Inhibitor
Name:
BDBM50382959
Synonyms:
CEP-32496 US9730937, Example 261
Type:
Small organic molecule
Emp. Form.:
C24H22F3N5O5
Mol. Mass.:
517.4572
SMILES:
COc1cc2ncnc(Oc3cccc(NC(=O)Nc4cc(on4)C(C)(C)C(F)(F)F)c3)c2cc1OC
: