Target
Glycogen phosphorylase, muscle form
Ligand
BDBM50382965
Substrate
Meas. Tech.
ChEMBL_818389 (CHEMBL2034616)
IC50
2700±n/a nM
Citation
 Krimm, ILancelin, JMPraly, JP Binding evaluation of fragment-based scaffolds for probing allosteric enzymes. J Med Chem 55:1287-95 (2012)  
Target
Name:
Glycogen phosphorylase, muscle form
Synonyms:
Glycogen Phosphorylase (PYGM) Glycogen phosphorylase, muscle form PYGM | PYGM_RABIT
Type:
Enzyme
Mol. Mass.:
97296.32
Organism:
Oryctolagus cuniculus (rabbit)
Description:
Phosphorylation of Ser-15 converts phosphorylase B (unphosphorylated) to phosphorylase A.
Residue:
843
  
Inhibitor
Name:
BDBM50382965
Synonyms:
CHEMBL2030483
Type:
Small organic molecule
Emp. Form.:
C18H17FN4OS
Mol. Mass.:
356.417
SMILES:
Cc1cc(F)c(Sc2nccn2C)cc1C(=O)Nc1cccc(N)c1
: