Target
Poly [ADP-ribose] polymerase tankyrase-2
Ligand
BDBM50294816
Substrate
Meas. Tech.
ChEMBL_818396 (CHEMBL2034623)
EC50
10000±n/a nM
Citation
 Narwal, MVenkannagari, HLehtiö, L Structural basis of selective inhibition of human tankyrases. J Med Chem 55:1360-7 (2012)  
Target
Name:
Poly [ADP-ribose] polymerase tankyrase-2
Synonyms:
(ARTD6 or PARP5b) Poly [ADP-ribose] polymerase tankyrase-2 TNKL TNKS2_HUMAN Tankyrase 2 Tankyrase-2 Tankyrase-2 (TNKS2)
Type:
Enzyme
Mol. Mass.:
126937.16
Organism:
Homo sapiens (Human)
Description:
Q9H2K2
Residue:
1166
  
Inhibitor
Name:
BDBM50294816
Synonyms:
4-((1R,2S,6R,7S)-3,5-Dioxo-4-aza-tricyclo[5.2.1.0*2,6*]dec-8-en-4-yl)-N-pyridin-4-ylmethyl-benzamide | CHEMBL551775
Type:
Small organic molecule
Emp. Form.:
C22H19N3O3
Mol. Mass.:
373.4046
SMILES:
Oc1c2[C@H]3C[C@H](C=C3)c2c(O)n1-c1ccc(cc1)C(=O)NCc1ccncc1
: