Target
Adenosine receptor A3
Ligand
BDBM50102284
Substrate
Meas. Tech.
ChEMBL_818430 (CHEMBL2034750)
Ki
>10000±n/a nM
Citation
 Taliani, SPugliesi, IBarresi, ESimorini, FSalerno, SLa Motta, CMarini, AMCosimelli, BCosconati, SDi Maro, SMarinelli, LDaniele, STrincavelli, MLGreco, GNovellino, EMartini, CDa Settimo, F 3-aryl-[1,2,4]triazino[4,3-a]benzimidazol-4(10H)-one: a novel template for the design of highly selective A2B adenosine receptor antagonists. J Med Chem 55:1490-9 (2012)  
Target
Name:
Adenosine receptor A3
Synonyms:
A3 adenosine receptor (hA3) ADORA3 | Adenosine A3 receptor (A3AR)
Type:
G Protein-Coupled Receptor (GPCR)
Mol. Mass.:
36197.32
Organism:
Homo sapiens (Human)
Description:
P0DMS8
Residue:
318
  
Inhibitor
Name:
BDBM50102284
Synonyms:
10-Benzyl-3-phenyl-10H-benzo[4,5]imidazo[2,1-c][1,2,4]triazin-4-one | CHEMBL326752
Type:
Small organic molecule
Emp. Form.:
C22H16N4O
Mol. Mass.:
352.3886
SMILES:
O=c1c(nnc2n(Cc3ccccc3)c3ccccc3n12)-c1ccccc1
: