Target
Tyrosine-protein kinase ZAP-70
Ligand
BDBM5544
Substrate
Meas. Tech.
ChEMBL_818690 (CHEMBL2033179)
Ki
>10000±n/a nM
Citation
 Anderson, PCDe Sapio, VTurner, KBElmer, SPRoe, DCSchoeniger, JS Identification of binding specificity-determining features in protein families. J Med Chem 55:1926-39 (2012)  
Target
Name:
Tyrosine-protein kinase ZAP-70
Synonyms:
70 kDa zeta-associated protein Syk-related tyrosine kinase Tyrosine-protein kinase ZAP-70 Tyrosine-protein kinase ZAP-70 (ZAP70) ZAP70 Zeta-chain (TCR) associated protein kinase 70kDa
Type:
Enzyme
Mol. Mass.:
69881.61
Organism:
Homo sapiens (Human)
Description:
ZAP-70 SH2 domain was expressed and purified from E. coli using O-phospho-L-tyrosine-agarose column.
Residue:
619
  
Inhibitor
Name:
BDBM5544
Synonyms:
4-{[6-(cyclohexylmethoxy)-9H-purin-2-yl]amino}benzene-1-sulfonamide NU6102
Type:
Small organic molecule
Emp. Form.:
C18H22N6O3S
Mol. Mass.:
402.471
SMILES:
NS(=O)(=O)c1ccc(Nc2nc(OCC3CCCCC3)c3[nH]cnc3n2)cc1
: