Target
Hepatocyte growth factor receptor
Ligand
BDBM50383200
Substrate
Meas. Tech.
ChEMBL_819189 (CHEMBL2032458)
IC50
96±n/a nM
Citation
 Liu, LNorman, MHLee, MXi, NSiegmund, ABoezio, AABooker, SChoquette, DD'Angelo, NDGermain, JYang, KYang, YZhang, YBellon, SFWhittington, DAHarmange, JCDominguez, CKim, TSDussault, I Structure-based design of novel class II c-Met inhibitors: 2. SAR and kinase selectivity profiles of the pyrazolone series. J Med Chem 55:1868-97 (2012)  
Target
Name:
Hepatocyte growth factor receptor
Synonyms:
Hepatocyte growth factor receptor Hepatocyte growth factor receptor (c-MET) MET Met proto-oncogene (hepatocyte growth factor receptor) Tyrosine-protein kinase Met (c-Met) c-Met kinase
Type:
Protein
Mol. Mass.:
155559.73
Organism:
Homo sapiens (Human)
Description:
P08581
Residue:
1390
  
Inhibitor
Name:
BDBM50383200
Synonyms:
CHEMBL2032026
Type:
Small organic molecule
Emp. Form.:
C28H25N5O5
Mol. Mass.:
511.5286
SMILES:
COc1ccc2c(Oc3ccc(NC(=O)c4c(C)n(CCO)n(-c5ccccc5)c4=O)nc3)ccnc2c1
: