Target
Ribosomal protein S6 kinase beta-1
Ligand
BDBM50383191
Substrate
Meas. Tech.
ChEMBL_819209 (CHEMBL2032478)
IC50
1000±n/a nM
Citation
 Liu, LNorman, MHLee, MXi, NSiegmund, ABoezio, AABooker, SChoquette, DD'Angelo, NDGermain, JYang, KYang, YZhang, YBellon, SFWhittington, DAHarmange, JCDominguez, CKim, TSDussault, I Structure-based design of novel class II c-Met inhibitors: 2. SAR and kinase selectivity profiles of the pyrazolone series. J Med Chem 55:1868-97 (2012)  
Target
Name:
Ribosomal protein S6 kinase beta-1
Synonyms:
70 kDa ribosomal protein S6 kinase 1 70 kDa ribosomal protein kinase (p70S6K) Protein kinase 70S6K (T412E) RPS6KB1 Ribosomal protein S6 kinase I STK14A p70S6K1
Type:
Enzyme
Mol. Mass.:
59139.89
Organism:
Homo sapiens (Human)
Description:
His-tagged S6K1.
Residue:
525
  
Inhibitor
Name:
BDBM50383191
Synonyms:
CHEMBL2031893
Type:
Small organic molecule
Emp. Form.:
C29H25FN4O5
Mol. Mass.:
528.531
SMILES:
COc1cc2nccc(Oc3ccc(NC(=O)c4c(C)n(C)n(-c5ccccc5)c4=O)cc3F)c2cc1OC
: