Target
Hepatocyte growth factor receptor
Ligand
BDBM50383212
Substrate
Meas. Tech.
ChEMBL_819216 (CHEMBL2032485)
Ki
60.2±n/a nM
Citation
 Norman, MHLiu, LLee, MXi, NFellows, ID'Angelo, NDDominguez, CRex, KBellon, SFKim, TSDussault, I Structure-based design of novel class II c-Met inhibitors: 1. Identification of pyrazolone-based derivatives. J Med Chem 55:1858-67 (2012)  
Target
Name:
Hepatocyte growth factor receptor
Synonyms:
Hepatocyte growth factor receptor Hepatocyte growth factor receptor (c-MET) MET Met proto-oncogene (hepatocyte growth factor receptor) Tyrosine-protein kinase Met (c-Met) c-Met kinase
Type:
Protein
Mol. Mass.:
155559.73
Organism:
Homo sapiens (Human)
Description:
P08581
Residue:
1390
  
Inhibitor
Name:
BDBM50383212
Synonyms:
CHEMBL2032036
Type:
Small organic molecule
Emp. Form.:
C29H26FN3O5
Mol. Mass.:
515.5322
SMILES:
COc1cc2nccc(Oc3ccc(NC(=O)C4CCN(Cc5ccccc5)C4=O)cc3F)c2cc1OC
: