Target
Serine/threonine-protein kinase pim-1
Ligand
BDBM50383268
Substrate
Meas. Tech.
ChEMBL_819566 (CHEMBL2033650)
IC50
10000±n/a nM
Citation
 Good, ACLiu, JHirth, BAsmussen, GXiang, YBiemann, HPBishop, KAFremgen, TFitzgerald, MGladysheva, TJain, AJancsics, KMetz, MPapoulis, ASkerlj, RStepp, JDWei, RR Implications of promiscuous Pim-1 kinase fragment inhibitor hydrophobic interactions for fragment-based drug design. J Med Chem 55:2641-8 (2012)  
Target
Name:
Serine/threonine-protein kinase pim-1
Synonyms:
PIM-1 Kinase PIM1_HUMAN Serine/threonine-protein kinase (PIM1) Serine/threonine-protein kinase PIM1 | Serine/threonine-protein kinase pim-1 (PIM1)
Type:
Protein
Mol. Mass.:
35681.82
Organism:
Homo sapiens (Human)
Description:
P11309
Residue:
313
  
Inhibitor
Name:
BDBM50383268
Synonyms:
CHEMBL2032371
Type:
Small organic molecule
Emp. Form.:
C10H8N2O2
Mol. Mass.:
188.1827
SMILES:
NC(=O)c1ccc2cccc(O)c2n1
: