Target
Lysosomal acid glucosylceramidase
Ligand
BDBM50383327
Substrate
Meas. Tech.
ChEMBL_820004 (CHEMBL2032679)
pH
5±n/a
Ki
1.8±n/a nM
Comments
extracted
Citation
 Goddard-Borger, EDTropak, MBYonekawa, STysoe, CMahuran, DJWithers, SG Rapid assembly of a library of lipophilic iminosugars via the thiol-ene reaction yields promising pharmacological chaperones for the treatment of Gaucher disease. J Med Chem 55:2737-45 (2012)  
Target
Name:
Lysosomal acid glucosylceramidase
Synonyms:
Acid beta-glucosidase Beta-glucocerebrosidase D-glucosyl-N-acylsphingosine glucohydrolase GBA1 GC GLUC Glucosylceramidase (GBA) Glucosylceramidase precursor (Beta-glucocerebrosidase) (Acid beta-glucosidase) (D-glucosyl-N-acylsphingosine glucohydrolase) (Alglucerase) (Imiglucerase) beta-glucocerebrosidase (GCase)
Type:
Enzyme
Mol. Mass.:
59724.64
Organism:
Homo sapiens (Human)
Description:
The beta-Glu activity was measured with commercially available beta-glucocerebrosidase (Ceredase) as the enzyme source.
Residue:
536
  
Inhibitor
Name:
BDBM50383327
Synonyms:
CHEMBL2029772
Type:
Small organic molecule
Emp. Form.:
C13H27NO3S
Mol. Mass.:
277.423
SMILES:
CCCCCCSCC[C@H]1NC[C@@H](O)[C@H](O)[C@H]1O
: