Target
Lysosomal Pro-X carboxypeptidase
Ligand
BDBM50383427
Substrate
Meas. Tech.
ChEMBL_818259 (CHEMBL2034220)
IC50
0.9±n/a nM
Citation
 Graham, THLiu, WVerras, AReibarkh, MBleasby, KBhatt, URChen, QGarcia-Calvo, MGeissler, WMGorski, JNHe, HLassman, MELisnock, JLi, XShen, ZTong, XTung, ECWiltsie, JXie, DXu, SXiao, JHale, JJPinto, SShen, DM A new class of prolylcarboxypeptidase inhibitors, part 2: the aminocyclopentanes. Bioorg Med Chem Lett 22:2818-22 (2012)  
Target
Name:
Lysosomal Pro-X carboxypeptidase
Synonyms:
Angiotensinase C PCP PRCP Prolylcarboxypeptidase | Prolylcarboxypeptidase (PRCP)
Type:
Enzyme
Mol. Mass.:
55805.19
Organism:
Homo sapiens (Human)
Description:
P42785
Residue:
496
  
Inhibitor
Name:
BDBM50383427
Synonyms:
CHEMBL2031588
Type:
Small organic molecule
Emp. Form.:
C30H34Cl2F2N4O
Mol. Mass.:
575.52
SMILES:
CN(C)[C@]1(C)C[C@H]([C@@H](C1)c1ccc(F)cc1F)C(=O)N1CCC(CC1)c1cc(C)nn1-c1cc(Cl)ccc1Cl
: