Target
Lysosomal Pro-X carboxypeptidase
Ligand
BDBM50383420
Substrate
Meas. Tech.
ChEMBL_818259 (CHEMBL2034220)
IC50
0.8±n/a nM
Citation
 Graham, THLiu, WVerras, AReibarkh, MBleasby, KBhatt, URChen, QGarcia-Calvo, MGeissler, WMGorski, JNHe, HLassman, MELisnock, JLi, XShen, ZTong, XTung, ECWiltsie, JXie, DXu, SXiao, JHale, JJPinto, SShen, DM A new class of prolylcarboxypeptidase inhibitors, part 2: the aminocyclopentanes. Bioorg Med Chem Lett 22:2818-22 (2012)  
Target
Name:
Lysosomal Pro-X carboxypeptidase
Synonyms:
Angiotensinase C PCP PRCP Prolylcarboxypeptidase | Prolylcarboxypeptidase (PRCP)
Type:
Enzyme
Mol. Mass.:
55805.19
Organism:
Homo sapiens (Human)
Description:
P42785
Residue:
496
  
Inhibitor
Name:
BDBM50383420
Synonyms:
CHEMBL2031596
Type:
Small organic molecule
Emp. Form.:
C29H32ClF3N4O
Mol. Mass.:
545.039
SMILES:
CN(C)[C@@]1(C)C[C@@H]([C@H](C1)c1ccc(F)cc1F)C(=O)N1CCC(CC1)c1ccnn1-c1ccc(F)c(Cl)c1
: