Target
Cholesteryl ester transfer protein
Ligand
BDBM50383591
Substrate
Meas. Tech.
ChEMBL_818747 (CHEMBL2033274)
IC50
36±n/a nM
Citation
 Escribano, AMateo, AIMartin de la Nava, EMMayhugh, DRCockerham, SLBeyer, TPSchmidt, RJCao, GZhang, YJones, TMBorel, AGSweetana, SACannady, EAMantlo, NB Design and synthesis of new tetrahydroquinolines derivatives as CETP inhibitors. Bioorg Med Chem Lett 22:3671-5 (2012)  
Target
Name:
Cholesteryl ester transfer protein
Synonyms:
CETP Cholesteryl ester transfer protein (CETP) | Lipid transfer protein I
Type:
Enzyme
Mol. Mass.:
54751.53
Organism:
Homo sapiens (Human)
Description:
P11597
Residue:
493
  
Inhibitor
Name:
BDBM50383591
Synonyms:
CHEMBL2032422
Type:
Small organic molecule
Emp. Form.:
C28H29F9N6O3
Mol. Mass.:
668.5539
SMILES:
CC(C)OC(=O)N1[C@H](C)C[C@H](N(Cc2cc(cc(c2)C(F)(F)F)C(F)(F)F)c2nnn(CCCO)n2)c2cc(ccc12)C(F)(F)F
: